randid,death,angina,hospmi,mi_fchd,anychd,stroke,cvd,hyperten,timeap,timemi,timemifc,timechd,timestrk,timecvd,timedth,timehyp,sex1,totchol1,age1,sysbp1,diabp1,cursmoke1,cigpday1,bmi1,diabetes1,bpmeds1,heartrte1,glucose1,prevchd1,prevap1,prevmi1,prevstrk1,prevhyp1,hdlc1,ldlc1,sex2,totchol2,age2,sysbp2,diabp2,cursmoke2,cigpday2,bmi2,diabetes2,bpmeds2,heartrte2,glucose2,prevchd2,prevap2,prevmi2,prevstrk2,prevhyp2,hdlc2,ldlc2,sex3,totchol3,age3,sysbp3,diabp3,cursmoke3,cigpday3,bmi3,diabetes3,bpmeds3,heartrte3,glucose3,prevchd3,prevap3,prevmi3,prevstrk3,prevhyp3,hdlc3,ldlc3,bmidiff
2448,"No","No","Yes","Yes","Yes","No","Yes","No",24,17.62628337,17.62628337,17.62628337,24,17.62628365,24,24,"Male",195,39,106,70,"No",0,26.97,"No","No",80,77,"No","No","No","No","No",,,,,,,,,,,,,,,,,,,,,,"Male",209,52,121,66,"No",0,,"No","No",69,92,"No","No","No","No","No",31,178,
6238,"No","No","No","No","No","No","No","No",24,24,24,24,24,24,24,24,"Female",250,46,121,81,"No",0,28.73,"No","No",95,76,"No","No","No","No","No",,,"Female",260,52,105,69.5,"No",0,29.43,"No","No",80,86,"No","No","No","No","No",,,"Female",237,58,108,66,"No",0,28.5,"No","No",80,71,"No","No","No","No","No",54,141,-.7
9428,"No","No","No","No","No","No","No","No",24,24,24,24,24,24,24,24,"Male",245,48,127.5,80,"Yes",20,25.34,"No","No",75,70,"No","No","No","No","No",,,"Male",283,54,141,89,"Yes",30,25.34,"No","No",75,87,"No","No","No","No","No",,,,,,,,,,,,,,,,,,,,,,0
10552,"Yes","No","No","No","No","Yes","Yes","Yes",8.093086927,8.093086927,8.093086927,8.093086927,5.719370294,5.719370365,8.093086927,0,"Female",225,61,150,95,"Yes",30,28.58,"No","No",65,103,"No","No","No","No","Yes",,,"Female",232,67,183,109,"Yes",20,30.18,"No","No",60,89,"No","No","No","No","Yes",,,,,,,,,,,,,,,,,,,,,,-1.6
11252,"No","No","No","No","No","No","No","Yes",24,24,24,24,24,24,24,11.73169062,"Female",285,46,130,84,"Yes",23,23.1,"No","No",85,85,"No","No","No","No","No",,,"Female",343,51,109,77,"Yes",30,23.48,"No","No",90,72,"No","No","No","No","No",,,"Female",,58,155,90,"Yes",30,24.61,"No","No",74,,"No","No","No","No","Yes",,,-.38
11263,"No","No","No","Yes","Yes","No","Yes","Yes",24,24,15.65776865,15.65776865,24,15.65776825,24,0,"Female",228,43,180,110,"No",0,30.3,"No","No",77,99,"No","No","No","No","Yes",,,"Female",230,49,177,102,"No",0,31.36,"No","Yes",120,86,"No","No","No","No","Yes",,,"Female",220,55,180,106,"No",0,31.17,"Yes","Yes",86,81,"No","No","No","No","Yes",46,135,-1.06
12629,"No","Yes","No","No","Yes","No","No","Yes",1.021218344,24,24,1.021218344,24,24,24,6.056125941,"Female",205,63,138,71,"No",0,33.11,"No","No",60,85,"No","No","No","No","No",,,"Female",220,70,149,81,"No",0,36.76,"No","No",80,98,"Yes","Yes","No","No","Yes",,,,,,,,,,,,,,,,,,,,,,-3.65
12806,"No","No","No","No","No","No","No","Yes",24,24,24,24,24,24,24,23.76180698,"Female",313,45,100,71,"Yes",20,21.68,"No","No",79,78,"No","No","No","No","No",,,"Female",,51,109.5,72.5,"Yes",30,22.19,"No","No",75,,"No","No","No","No","No",,,"Female",320,57,110,46,"Yes",30,22.02,"No","No",75,87,"No","No","No","No","No",34,286,-.51
14367,"No","No","No","No","No","No","No","Yes",24,24,24,24,24,24,24,0,"Male",260,52,141.5,89,"No",0,26.36,"No","No",76,79,"No","No","No","No","Yes",,,"Male",292,58,132,90,"No",0,25.39,"No","No",85,81,"No","No","No","No","Yes",,,"Male",280,64,168,100,"No",0,25.72,"No","No",92,82,"No","No","No","No","Yes",44,236,.97
16365,"No","No","No","No","No","No","No","Yes",24,24,24,24,24,24,24,0,"Male",225,43,162,107,"Yes",30,23.61,"No","No",93,88,"No","No","No","No","Yes",,,"Male",258,49,147,102,"No",0,27.5,"No","Yes",75,74,"No","No","No","No","Yes",,,"Male",211,55,173,123,"No",0,29.11,"No","Yes",75,85,"No","No","No","No","Yes",48,163,-3.89
16799,"No","No","No","No","No","No","No","No",24,24,24,24,24,24,24,24,"Female",254,50,133,76,"No",0,22.91,"No","No",75,76,"No","No","No","No","No",,,"Female",,56,127.5,70,"No",0,20.3,"No","No",60,73,"No","No","No","No","No",,,"Female",291,62,120,70,"No",0,21.98,"No",,62,83,"No","No","No","No","No",60,217,2.61
19304,"No","No","No","No","No","No","No","No",24,24,24,24,24,24,24,24,"Female",247,43,131,88,"No",0,27.64,"No","No",72,61,"No","No","No","No","No",,,,,,,,,,,,,,,,,,,,,,,,,,,,,,,,,,,,,,,,,
20375,"No","No","No","No","No","No","No","Yes",24,24,24,24,24,24,24,0,"Male",294,46,142,94,"Yes",15,26.31,"No","No",98,64,"No","No","No","No","Yes",,,"Male",288,52,165,92,"Yes",10,26.44,"No","No",105,71,"No","No","No","No","Yes",,,,,,,,,,,,,,,,,,,,,,-.13
23727,"Yes","No","No","No","No","No","No","Yes",15.3100616,15.3100616,15.3100616,15.3100616,15.3100616,15.31006145,15.3100616,0,"Female",332,41,124,88,"No",0,31.31,"No","Yes",65,84,"No","No","No","No","Yes",,,"Female",225,47,120,80,"No",0,27.98,"No","Yes",75,74,"No","No","No","No","Yes",,,"Female",159,53,124,78,"No",0,26.62,"No","No",68,135,"No","No","No","No","Yes",53,106,3.33
24721,"Yes","No","No","No","No","No","No","Yes",17.5523614,17.5523614,17.5523614,17.5523614,17.5523614,17.55236053,17.5523614,12.06844627,"Female",226,39,114,64,"Yes",9,22.35,"No","No",85,,"No","No","No","No","No",,,"Female",196,46,136,89,"Yes",50,21.24,"No","No",110,76,"No","No","No","No","No",,,"Female",264,51,141,81,"Yes",15,24.77,"No","No",85,97,"No","No","No","No","Yes",58,206,1.11
30928,"Yes","No","No","No","No","No","No","Yes",.3997262149,.3997262149,.3997262149,.3997262149,.3997262149,.399726212,.3997262149,0,"Female",221,38,140,90,"Yes",20,21.35,"No","No",95,70,"No","No","No","No","Yes",,,,,,,,,,,,,,,,,,,,,,,,,,,,,,,,,,,,,,,,,
33077,"No","No","No","No","No","No","No","Yes",24,24,24,24,24,24,24,0,"Male",232,48,138,90,"Yes",10,22.37,"No","No",64,72,"No","No","No","No","Yes",,,"Male",222,54,139.5,82,"Yes",6,21.76,"No","No",70,,"No","No","No","No","Yes",,,"Male",215,60,144.5,80,"Yes",10,22.96,"No","No",57,91,"No","No","No","No","Yes",62,135,.61
33555,"Yes","No","No","No","No","No","No","No",3.947980835,3.947980835,3.947980835,3.947980835,3.947980835,3.947980881,3.947980835,3.947980835,"Female",291,46,112,78,"Yes",20,23.38,"No","No",80,89,"No","No","No","No","No",,,,,,,,,,,,,,,,,,,,,,,,,,,,,,,,,,,,,,,,,
34689,"No","No","No","No","No","No","No","Yes",24,24,24,24,24,24,24,5.905544148,"Female",195,38,122,84.5,"Yes",5,23.24,"No","No",75,78,"No","No","No","No","No",,,"Female",265,44,139,95,"Yes",7,30.05,"No","Yes",90,80,"No","No","No","No","Yes",,,"Female",212,49,163,96,"Yes",10,31.45,"No","No",82,84,"No","No","No","No","Yes",40,172,-6.81
36459,"No","No","No","No","No","No","No","Yes",24,24,24,24,24,24,24,4.021902806,"Male",195,41,139,88,"No",0,26.88,"No","No",85,65,"No","No","No","No","No",,,"Male",201,47,160,101,"No",0,26.28,"No","No",90,69,"No","No","No","No","Yes",,,"Male",162,53,152.5,101,"No",0,26.43,"No","No",105,78,"No","No","No","No","Yes",31,91,.6
40435,"No","No","No","No","No","No","No","Yes",24,24,24,24,24,24,24,16.24366872,"Female",190,42,108,70.5,"Yes",30,21.59,"No","No",72,85,"No","No","No","No","No",,,"Female",244,48,122,77.5,"Yes",60,21.77,"No","No",75,89,"No","No","No","No","No",,,"Female",226,54,126,75,"Yes",40,21.59,"No","No",85,102,"No","No","No","No","No",84,142,-.18
43522,"No","No","No","No","No","No","No","Yes",24,24,24,24,24,24,24,14.30800821,"Female",185,43,123.5,77.5,"No",0,29.89,"No","No",70,,"No","No","No","No","No",,,"Female",270,49,127,84,"No",0,34.55,"No","No",65,85,"No","No","No","No","No",,,"Female",,55,129,76,"No",0,35.71,"No","No",76,,"No","No","No","No","No",,,-4.66
43770,"Yes","No","Yes","Yes","Yes","No","Yes","Yes",17.54962355,17.47843943,17.47843943,17.47843943,17.54962355,17.47843933,17.54962355,1.979466119,"Female",234,52,148,78,"No",0,34.17,"No","No",70,113,"No","No","No","No","No",,,"Female",272,58,162,78,"No",0,33.29,"Yes","No",60,123,"No","No","No","No","Yes",,,"Female",283,64,159,69,"No",0,32.93,"Yes","No",70,230,"No","No","No","No","Yes",45,238,.88
45464,"No","No","No","No","No","No","No","Yes",24,24,24,24,24,24,24,5.960301164,"Female",215,52,132,82,"Yes",20,25.11,"No","No",71,75,"No","No","No","No","No",,,"Female",256,58,151,86,"Yes",20,22.73,"No","No",80,93,"No","No","No","No","Yes",,,"Female",236,64,150,89,"Yes",20,24.01,"No","No",90,80,"No","No","No","No","Yes",93,143,2.38
47561,"No","No","No","No","No","No","No","Yes",24,24,24,24,24,24,24,0,"Male",270,44,137.5,90,"Yes",30,21.96,"No","No",75,83,"No","No","No","No","Yes",,,"Male",300,50,134,88,"Yes",35,23.81,"No","No",80,82,"No","No","No","No","Yes",,,"Male",290,56,132,70,"Yes",40,22.73,"No","No",100,90,"No","No","No","No","Yes",54,236,-1.85
54224,"Yes","No","Yes","Yes","Yes","No","Yes","No",1.177275838,1.177275838,1.177275838,1.177275838,1.177275838,1.177275896,1.177275838,1.177275838,"Male",294,47,102,68,"Yes",20,24.18,"No","No",62,66,"No","No","No","No","No",,,,,,,,,,,,,,,,,,,,,,,,,,,,,,,,,,,,,,,,,
55965,"No","Yes","No","No","Yes","No","No","Yes",22.71594798,24,24,22.71594798,24,24,24,21.76865161,"Female",260,60,110,72.5,"No",0,26.59,"No","No",65,,"No","No","No","No","No",,,"Female",256,66,126,82,"No",0,25.43,"No","No",60,77,"No","No","No","No","No",,,"Female",298,72,109,60,"No",0,26.2,"No","No",80,100,"No","No","No","No","No",38,260,1.16
63156,"No","No","No","No","No","No","No","Yes",24,24,24,24,24,24,24,0,"Male",225,35,132,91,"Yes",20,26.09,"No","No",73,83,"No","No","No","No","Yes",,,"Male",233,41,123,82,"Yes",20,25.01,"No","No",75,67,"No","No","No","No","Yes",,,"Male",240,47,131,90,"No",0,26.77,"No","No",70,76,"No","No","No","No","Yes",40,200,1.08
63221,"Yes","No","No","Yes","Yes","No","Yes","Yes",.4599589322,.4599589322,.4599589322,.4599589322,.4599589322,.4599589407,.4599589322,0,"Female",272,61,182,121,"No",0,32.8,"No","No",85,65,"No","No","No","No","Yes",,,,,,,,,,,,,,,,,,,,,,,,,,,,,,,,,,,,,,,,,
66472,"Yes","No","No","No","No","Yes","Yes","Yes",23.06091718,23.06091718,23.06091718,23.06091718,22.13552361,22.13552284,23.06091718,4.005475702,"Female",247,60,130,88,"No",0,30.36,"No","No",72,74,"No","No","No","No","No",,,"Female",248,66,135,75,"No",0,30.16,"No","No",76,76,"No","No","No","No","Yes",,,"Female",249,72,157,87,"No",0,29.55,"Yes","No",65,73,"No","No","No","No","Yes",78,171,.2
67905,"No","No","No","No","No","No","No","Yes",24,24,24,24,24,24,24,8.087611225,"Male",295,36,102,68,"Yes",35,28.15,"No","No",60,63,"No","No","No","No","No",,,"Male",292,42,126,90,"Yes",35,29.84,"No","No",55,65,"No","No","No","No","No",,,"Male",300,48,125,83,"No",0,34.34,"No","No",58,96,"No","No","No","No","Yes",47,253,-1.69
68194,"No","No","No","No","No","No","No","Yes",24,24,24,24,24,24,24,16.97193703,"Male",226,43,115,85.5,"Yes",43,27.57,"No","No",75,75,"No","No","No","No","No",,,"Male",232,49,123,86,"Yes",40,27.86,"No","No",75,66,"No","No","No","No","No",,,"Male",206,55,129,85,"Yes",50,26.4,"No","No",84,69,"No","No","No","No","No",47,159,-.29
68397,"No","Yes","Yes","Yes","Yes","No","No","Yes",0,0,0,0,24,24,24,2.149212868,"Male",227,40,125,90,"No",0,23.62,"No","No",86,79,"Yes","Yes","Yes","No","No",,,"Male",296,46,118,90,"Yes",10,23.34,"No",,60,78,"Yes","Yes","Yes","No","Yes",,,"Male",320,53,148,89,"Yes",8,22.78,"No","No",80,110,"Yes","Yes","Yes","No","Yes",42,278,.28
69134,"Yes","No","No","No","No","Yes","Yes","Yes",2.866529774,2.866529774,2.866529774,2.866529774,1.98220397,1.98220396,2.866529774,0,"Female",209,59,150,85,"No",0,20.77,"No","No",90,88,"No","No","No","No","Yes",,,,,,,,,,,,,,,,,,,,,,,,,,,,,,,,,,,,,,,,,
70948,"Yes","Yes","No","No","Yes","No","No","Yes",7.055441478,19.02258727,19.02258727,7.055441478,19.02258727,19.02258682,19.02258727,3.972621492,"Male",175,61,134,82.5,"Yes",5,18.59,"No","No",72,75,"No","No","No","No","No",,,"Male",207,67,133,74,"Yes",20,17.65,"No","No",75,74,"No","No","No","No","Yes",,,"Male",283,73,145,85,"Yes",3,17.28,"No","No",88,80,"Yes","Yes","No","No","Yes",65,218,.94
76273,"Yes","Yes","No","No","Yes","No","No","No",0,3.879534565,3.879534565,0,3.879534565,3.879534483,3.879534565,3.879534565,"Male",235,62,125,74.5,"No",0,25.9,"No","No",65,73,"Yes","Yes","No","No","No",,,,,,,,,,,,,,,,,,,,,,,,,,,,,,,,,,,,,,,,,
77492,"Yes","No","No","Yes","Yes","No","Yes","Yes",15.98631075,15.98631075,15.98631075,15.98631075,15.98631075,15.98631096,15.98631075,0,"Male",214,54,147,74,"Yes",20,24.71,"No","No",96,87,"No","No","No","No","Yes",,,"Male",230,59,141,63,"No",0,22.33,"No","No",65,75,"No","No","No","No","Yes",,,"Male",199,65,180,82,"Yes",20,21.3,"No",,90,,"No","No","No","No","Yes",94,96,2.38
82188,"No","No","No","No","No","No","No","Yes",24,24,24,24,24,24,24,0,"Male",225,37,124.5,92.5,"No",0,38.53,"No","No",95,83,"No","No","No","No","Yes",,,"Male",244,43,156,109,"No",0,38.53,"No","No",85,67,"No","No","No","No","Yes",,,"Male",226,49,190,123,"No",0,45.43,"No","Yes",100,73,"No","No","No","No","Yes",34,192,0
82425,"No","No","No","No","No","Yes","Yes","Yes",24,24,24,24,21.14168378,21.14168358,24,2.056125941,"Male",257,56,153.5,102,"No",0,28.09,"No","No",72,75,"No","No","No","No","No",,,"Male",281,61,177,107,"No",0,29.86,"No","No",75,77,"No","No","No","No","Yes",,,"Male",226,67,157,95,"No",0,29.86,"No","No",88,99,"No","No","No","No","Yes",61,165,-1.77
83398,"Yes","No","No","No","No","Yes","Yes","Yes",17.16358658,17.16358658,17.16358658,17.16358658,15.02532512,15.02532482,17.16358658,0,"Male",178,52,160,98,"No",0,40.11,"Yes","No",75,225,"No","No","No","No","Yes",,,"Male",155,58,173,90,"No",0,36.88,"Yes","No",72,200,"No","No","No","No","Yes",,,"Male",,64,205,90,"No",0,36.55,"Yes","Yes",77,,"No","No","No","No","Yes",,,3.23
84815,"No","No","No","No","No","Yes","Yes","Yes",24,24,24,24,23.82477755,23.8247776,24,0,"Female",233,42,153,101,"Yes",1,28.93,"No","No",60,90,"No","No","No","No","Yes",,,"Female",242,48,155,106,"Yes",4,29.29,"No","No",60,,"No","No","No","No","Yes",,,"Female",246,54,202,111,"Yes",3,26.63,"No","No",63,80,"No","No","No","No","Yes",41,205,-.36
87124,"No","No","No","No","No","No","No","No",24,24,24,24,24,24,24,24,"Male",180,36,111,73,"No",0,27.78,"No","No",71,80,"No","No","No","No","No",,,"Male",205,42,112,80,"No",0,28.08,"No","No",65,81,"No","No","No","No","No",,,,,,,,,,,,,,,,,,,,,,-.3
90705,"No","No","No","No","No","No","No","No",24,24,24,24,24,24,24,24,"Female",243,43,116.5,80,"Yes",10,26.87,"No","No",68,78,"No","No","No","No","No",,,"Female",180,48,118.5,79,"Yes",15,30.34,"No","No",75,91,"No","No","No","No","No",,,"Female",216,54,100,75,"Yes",16,29.82,"No","No",70,68,"No","No","No","No","No",30,186,-3.47
94510,"No","No","No","No","No","No","No","No",24,24,24,24,24,24,24,24,"Female",237,41,122,78,"Yes",1,23.28,"No","No",75,74,"No","No","No","No","No",,,"Female",236,47,117,82,"Yes",1,23.65,"No","No",85,92,"No","No","No","No","No",,,"Female",293,53,127,77,"Yes",3,25.68,"No","No",90,115,"No","No","No","No","No",52,241,-.37
95148,"Yes","Yes","Yes","Yes","Yes","No","Yes","Yes",9.875427789,9.875427789,9.875427789,9.875427789,17.86173854,9.8754282,17.86173854,0,"Female",,52,148,92,"No",0,25.09,"No","Yes",70,,"No","No","No","No","Yes",,,"Female",268,58,135,75,"No",0,26.55,"No","Yes",75,105,"No","No","No","No","Yes",,,"Female",240,64,154,98,"No",0,26.91,"No",,70,,"Yes","Yes","Yes","No","Yes",46,168,-1.46
95182,"No","Yes","No","No","Yes","No","Yes","Yes",17.09240246,24,24,17.09240246,24,17.09240341,24,1.990417522,"Male",195,54,132,83.5,"No",0,26.21,"No","No",75,100,"No","No","No","No","No",,,"Male",198,60,133,77,"No",0,25.58,"No","No",80,74,"No","No","No","No","Yes",,,"Male",176,66,139,72,"No",0,27,"No","No",74,77,"No","No","No","No","Yes",26,150,.63
95541,"Yes","No","No","No","No","No","No","Yes",7.383983573,7.383983573,7.383983573,7.383983573,7.383983573,7.383983612,7.383983573,0,"Female",311,53,206,92,"No",0,21.51,"Yes","Yes",76,215,"No","No","No","No","Yes",,,"Female",281,59,160,80,"No",0,22.52,"Yes","Yes",80,269,"No","No","No","No","Yes",,,,,,,,,,,,,,,,,,,,,,-1.01
97026,"No","No","No","No","No","No","No","No",24,24,24,24,24,24,24,24,"Female",208,49,96,63,"No",0,20.68,"No","No",65,98,"No","No","No","No","No",,,"Female",242,55,112,70,"No",0,20.64,"No","No",75,107,"No","No","No","No","No",,,"Female",206,61,112,80,"No",0,21.96,"No",,63,138,"No","No","No","No","No",84,102,.04
97895,"Yes","No","No","Yes","Yes","Yes","Yes","Yes",16.35318275,16.35318275,16.35318275,15.93155373,15.70157426,15.70157433,16.35318275,0,"Female",252,65,179.5,114,"No",0,30.47,"No","No",90,87,"No","No","No","No","Yes",,,"Female",286,70,181,105,"No",0,30.64,"No","No",80,,"No","No","No","No","Yes",,,"Female",,77,215,105,"No",0,29.76,"No","No",73,61,"No","No","No","No","Yes",,,-.17
98536,"No","No","No","No","No","No","No","Yes",24,24,24,24,24,24,24,18.4366872,"Male",261,46,119,77.5,"Yes",20,23.59,"No","No",75,74,"No","No","No","No","No",,,"Male",248,52,124,80,"Yes",20,23.45,"No","No",75,71,"No","No","No","No","No",,,"Male",241,58,135,70,"Yes",30,25.68,"No","No",90,93,"No","No","No","No","No",41,200,.14
100722,"Yes","No","No","No","No","No","No","No",5.149897331,5.149897331,5.149897331,5.149897331,5.149897331,5.149897099,5.149897331,5.149897331,"Female",179,63,116,69,"Yes",40,22.15,"No","No",95,75,"No","No","No","No","No",,,,,,,,,,,,,,,,,,,,,,,,,,,,,,,,,,,,,,,,,
101990,"Yes","Yes","Yes","Yes","Yes","No","Yes","Yes",16.09856263,22.75701574,22.75701574,15.72895277,22.75701574,15.72895241,22.75701574,0,"Male",194,36,139,93,"Yes",20,24.33,"No",,80,62,"No","No","No","No","Yes",,,"Male",248,43,152,105,"Yes",30,25.27,"No","No",70,86,"No","No","No","No","Yes",,,"Male",230,49,142,90.5,"Yes",35,24.33,"No","No",70,61,"No","No","No","No","Yes",30,200,-.94
110542,"Yes","No","No","No","No","No","No","Yes",9.075975359,9.075975359,9.075975359,9.075975359,9.075975359,9.075975418,9.075975359,0,"Female",267,63,156.5,92.5,"Yes",3,27.1,"No","No",60,79,"No","No","No","No","Yes",,,"Female",290,70,198,105,"Yes",3,26.93,"No","Yes",65,76,"No","No","No","No","Yes",,,,,,,,,,,,,,,,,,,,,,.17
111019,"No","No","No","No","No","No","No","No",24,24,24,24,24,24,24,24,"Male",216,51,112,66,"No",0,23.47,"No","No",90,95,"No","No","No","No","No",,,,,,,,,,,,,,,,,,,,,,,,,,,,,,,,,,,,,,,,,
112297,"No","No","No","No","No","No","No","Yes",24,24,24,24,24,24,24,16.36413415,"Female",237,47,130,78,"Yes",20,19.66,"No","No",80,75,"No","No","No","No","No",,,"Female",324,53,139,88.5,"Yes",30,20.56,"No","No",80,61,"No","No","No","No","No",,,"Female",251,59,132,77,"Yes",20,19.3,"No","No",82,76,"No","No","No","No","No",53,197,-.9
112469,"No","No","No","No","No","No","No","Yes",24,24,24,24,24,24,24,4.005475702,"Female",240,62,145,82.5,"No",0,28.27,"No","No",63,75,"No","No","No","No","No",,,"Female",240,68,133,81,"No",0,27.72,"No","No",63,74,"No","No","No","No","Yes",,,"Female",224,74,125,68,"No",0,27.35,"No","No",80,109,"No","No","No","No","Yes",35,189,.55
123622,"No","No","No","No","No","No","No","Yes",24,24,24,24,24,24,24,23.33744011,"Female",209,39,115,75,"Yes",20,22.54,"No","No",90,,"No","No","No","No","No",,,"Female",276,45,115,73,"Yes",20,23.46,"No","No",95,80,"No","No","No","No","No",,,"Female",241,51,145,85,"Yes",20,25.66,"No","No",96,102,"No","No","No","No","No",68,173,-.92
125413,"No","No","No","No","No","No","No","Yes",24,24,24,24,24,24,24,11.97262149,"Female",250,46,116,71,"Yes",10,20.35,"No","No",88,94,"No","No","No","No","No",,,"Female",,53,130,76,"Yes",10,21.14,"No","No",85,,"No","No","No","No","No",,,"Female",,58,147,70,"Yes",8,21.33,"No","No",95,,"No","No","No","No","Yes",,,-.79
126721,"No","No","No","No","No","No","No","No",15.92881588,15.92881588,15.92881588,15.92881588,15.92881588,15.92881584,24,15.92881588,"Female",266,54,114,76,"Yes",9,17.61,"Yes","No",88,55,"No","No","No","No","No",,,,,,,,,,,,,,,,,,,,,,,,,,,,,,,,,,,,,,,,,
127109,"No","No","No","No","No","No","No","Yes",24,24,24,24,24,24,24,0,"Male",255,49,143.5,81,"Yes",2,25.65,"No","No",75,80,"No","No","No","No","Yes",,,"Male",296,55,133,85,"No",0,25.95,"No","No",70,83,"No","No","No","No","Yes",,,"Male",241,60,132,86,"No",0,25.62,"No",,63,,"No","No","No","No","Yes",47,172,-.3
127196,"Yes","Yes","Yes","Yes","Yes","No","Yes","No",14.55715264,19.43874059,19.43874059,14.55715264,19.44421629,14.55715275,19.44421629,19.44421629,"Male",185,44,115,69,"No",0,22.29,"No","No",65,82,"No","No","No","No","No",,,"Male",226,50,108,74,"No",0,20.56,"No","No",80,79,"No","No","No","No","No",,,"Male",216,56,117,70,"Yes",20,21.35,"No","No",72,49,"No","No","No","No","No",42,174,1.73
134914,"No","Yes","No","No","Yes","No","No","Yes",3.017111567,24,24,3.017111567,24,24,24,2.031485284,"Female",205,40,158,102,"Yes",20,25.45,"No","No",75,87,"No","No","No","No","No",,,"Female",194,46,208,127,"Yes",20,26,"No","Yes",85,62,"Yes","Yes","No","No","Yes",,,"Female",180,52,195,107,"Yes",40,22.36,"No","Yes",68,75,"Yes","Yes","No","No","Yes",60,120,-.55
147250,"No","No","No","No","No","No","No","Yes",24,24,24,24,24,24,24,14.85557837,"Male",270,56,121,79,"Yes",20,23.58,"No","No",95,93,"No","No","No","No","No",,,"Male",303,62,120,74,"Yes",30,22.45,"No","No",80,70,"No","No","No","No","No",,,"Male",229,68,145,77,"Yes",20,23.09,"No","No",72,83,"No","No","No","No","No",39,170,1.13
149386,"Yes","No","No","No","No","No","No","Yes",15.12936345,15.12936345,15.12936345,15.12936345,15.12936345,15.12936306,15.12936345,0,"Female",254,67,157,89,"No",0,24.25,"No","No",60,74,"No","No","No","No","Yes",,,"Female",277,73,180,80,"No",0,23.67,"No","No",68,62,"No","No","No","No","Yes",,,"Female",262,79,188,104,"No",0,20.26,"No",,61,82,"No","No","No","No","Yes",54,185,.58
151110,"Yes","No","No","No","No","No","No","Yes",14.44490075,14.44490075,14.44490075,14.44490075,14.44490075,14.44490051,14.44490075,11.99178645,"Male",220,53,123.5,75,"Yes",20,19.64,"No","No",78,73,"No","No","No","No","No",,,"Male",239,59,129,78,"Yes",10,21.68,"No","No",73,82,"No","No","No","No","No",,,"Male",276,65,148,84,"No",0,19.64,"No",,80,88,"No","No","No","No","Yes",39,189,-2.04
153093,"Yes","No","Yes","Yes","Yes","No","Yes","No",13.34702259,13.34702259,13.34702259,13.34702259,13.34702259,13.34702301,13.34702259,13.34702259,"Female",235,57,126.5,80,"Yes",3,24.88,"No","No",83,72,"No","No","No","No","No",,,"Female",232,63,122,64,"Yes",10,27.26,"No","No",80,104,"No","No","No","No","No",,,"Female",236,69,125,74,"Yes",20,22.49,"Yes","No",90,103,"No","No","No","No","No",30,206,-2.38
157585,"Yes","No","Yes","Yes","Yes","No","Yes","Yes",4.435318275,4.435318275,4.435318275,4.435318275,4.435318275,4.43531847,4.435318275,4.030116359,"Male",220,57,136,84,"No",0,26.84,"No","No",75,64,"No","No","No","No","No",,,,,,,,,,,,,,,,,,,,,,,,,,,,,,,,,,,,,,,,,
160953,"Yes","No","No","No","No","Yes","Yes","Yes",15.25530459,15.25530459,15.25530459,15.25530459,9.853524983,9.853525162,15.25530459,0,"Female",252,63,154,87,"No",0,28.6,"No","No",72,45,"No","No","No","No","Yes",,,"Female",249,69,137,85.5,"No",0,27.56,"No","No",95,77,"No","No","No","No","Yes",,,"Female",246,75,153,78,"No",0,25.31,"No","No",110,83,"No","No","No","Yes","Yes",54,192,1.04
162207,"Yes","No","No","No","Yes","No","Yes","Yes",23.01437372,23.01437372,23.01437372,14.81998631,23.01437372,14.81998634,23.01437372,0,"Female",212,62,190,99,"No",0,29.64,"Yes","No",100,202,"No","No","No","No","Yes",,,"Female",245,68,194,92,"No",0,31.8,"Yes","Yes",94,180,"No","No","No","No","Yes",,,"Female",194,74,206,106,"No",0,31.45,"Yes",,120,178,"No","No","No","No","Yes",59,121,-2.16
162837,"No","No","No","No","No","No","No","No",24,24,24,24,24,24,24,24,"Male",223,38,107,73,"Yes",20,23.01,"No","No",65,78,"No","No","No","No","No",,,"Male",266,44,122,81,"Yes",20,24.51,"No",,70,63,"No","No","No","No","No",,,"Male",238,50,113,75,"Yes",10,23.35,"No","No",90,89,"No","No","No","No","No",46,192,-1.5
165891,"No","No","No","No","No","No","No","Yes",24,24,24,24,24,24,24,14.19849418,"Female",300,47,112.5,60,"Yes",20,20.13,"No","No",76,83,"No","No","No","No","No",,,"Female",348,53,108,65,"Yes",20,20.08,"No","No",80,76,"No","No","No","No","No",,,"Female",314,59,143,66,"Yes",20,18.32,"No","No",93,96,"No","No","No","No","No",61,237,.05
168256,"No","No","No","No","No","No","No","No",24,24,24,24,24,24,24,24,"Female",302,52,110,67.5,"No",0,23.51,"No","No",63,87,"No","No","No","No","No",,,"Female",301,59,127,83,"No",0,23.51,"No","No",60,69,"No","No","No","No","No",,,"Female",272,64,116,66,"No",0,23.18,"No","No",77,74,"No","No","No","No","No",41,231,0